BDBM50157320 (S)-1-Methyl-piperazine-2-carboxylic acid [(R)-2-(4-tert-butylcarbamoyl-4-cyclohexyl-piperidin-1-yl)-1-(4-fluoro-benzyl)-2-oxo-ethyl]-amide; dihydrochloride::CHEMBL2113028
SMILES CC(C)(C)NC(=O)C1(CCN(CC1)C(=O)[C@@H](Cc1ccc(F)cc1)NC(=O)[C@@H]1CNCCN1C(=O)OC(C)(C)C)C1CCCCC1
InChI Key InChIKey=AQQUROKWABNSSB-FTJBHMTQSA-N
Data  1 IC50  2 EC50
  Tab Delimited (TSV)   2D SDfile   Computed 3D by Vconf -m prep SDfile
Find this compound or compounds like it in BindingDB:
Activity Spreadsheet -- Enzyme Inhibition Constant Data from BindingDB
Found 2 hits for monomerid = 50157320
TargetMelanocortin receptor 4(Homo sapiens (Human))
Merck Research Laboratories
Curated by ChEMBL
LigandPNGBDBM50157320((S)-1-Methyl-piperazine-2-carboxylic acid [(R)-2-(...)
Affinity DataEC50:  13nM. Assay description: Effective concentration towards human melanocortin-4 receptor mediated cAMP accumulation in CHO cells
In DepthDetails ArticlePubMed
TargetMelanocortin receptor 4(Homo sapiens (Human))
Merck Research Laboratories
Curated by ChEMBL
LigandPNGBDBM50157320((S)-1-Methyl-piperazine-2-carboxylic acid [(R)-2-(...)
Affinity DataIC50:  18nM. Assay description: Concentration for 50% inhibition of human melanocortin-4 receptor expressed in CHO cells using [125I]NDP-alpha-MSH as radioligand
In DepthDetails ArticlePubMed